Target
Methyl-CpG-binding domain protein 2
Ligand
BDBM82809
Substrate
Meas. Tech.
TRFRET-based biochemical high throughput dose response assay to identify inhibitors of 5-meCpG-binding domain protein 2 (MBD2)-DBD binding to methylated oligonucleotide
IC50
43799±n/a nM
Citation
 PubChem, PC TRFRET-based biochemical high throughput dose response assay to identify inhibitors of 5-meCpG-binding domain protein 2 (MBD2)-DBD binding to methylated oligonucleotide PubChem Bioassay (2013)[AID] 
Target
Name:
Methyl-CpG-binding domain protein 2
Synonyms:
MBD2 Methyl-CpG binding domain protein 2 | Methyl-CpG-binding domain protein 2 (MBD2)
Type:
Enzyme Catalytic Domain
Mol. Mass.:
43278.74
Organism:
Homo sapiens (Human)
Description:
gi_21595776
Residue:
411
  
Inhibitor
Name:
BDBM82809
Synonyms:
4-[[(Z)-[1-(2-furanylmethyl)-2,4,6-trioxo-1,3-diazinan-5-ylidene]methyl]amino]benzamide 4-[[(Z)-[1-(furan-2-ylmethyl)-2,4,6-trioxo-1,3-diazinan-5-ylidene]methyl]amino]benzamide MLS000718966 cid_5962919
Type:
Small organic molecule
Emp. Form.:
C17H14N4O5
Mol. Mass.:
354.3169
SMILES:
NC(=O)c1ccc(NC=C2C(=O)NC(=O)N(Cc3ccco3)C2=O)cc1
: