Target
Methyl-CpG-binding domain protein 2
Ligand
BDBM114643
Substrate
Meas. Tech.
TRFRET-based biochemical high throughput dose response assay to identify inhibitors of 5-meCpG-binding domain protein 2 (MBD2)-DBD binding to methylated oligonucleotide
IC50
6606±n/a nM
Citation
 PubChem, PC TRFRET-based biochemical high throughput dose response assay to identify inhibitors of 5-meCpG-binding domain protein 2 (MBD2)-DBD binding to methylated oligonucleotide PubChem Bioassay (2013)[AID] 
Target
Name:
Methyl-CpG-binding domain protein 2
Synonyms:
MBD2 Methyl-CpG binding domain protein 2 | Methyl-CpG-binding domain protein 2 (MBD2)
Type:
Enzyme Catalytic Domain
Mol. Mass.:
43278.74
Organism:
Homo sapiens (Human)
Description:
gi_21595776
Residue:
411
  
Inhibitor
Name:
BDBM114643
Synonyms:
1-[2-(dimethylamino)ethylamino]-4-(hydroxymethyl)-7-oxidanyl-thioxanthen-9-one 1-[2-(dimethylamino)ethylamino]-7-hydroxy-4-(hydroxymethyl)thioxanthen-9-one 9H-Thioxanthen-9-one, 1-[[2-(dimethylamino)ethyl]amino]-7-hydroxy-4-(hydroxymethyl)- SMR001566699 | cid_333459
Type:
Small organic molecule
Emp. Form.:
C18H20N2O3S
Mol. Mass.:
344.428
SMILES:
CN(C)CCNc1ccc(CO)c2sc3ccc(O)cc3c(=O)c12
: