Target
Methyl-CpG-binding domain protein 2
Ligand
BDBM83853
Substrate
Meas. Tech.
TRFRET-based biochemical high throughput dose response assay to identify inhibitors of 5-meCpG-binding domain protein 2 (MBD2)-DBD binding to methylated oligonucleotide
IC50
6689±n/a nM
Citation
 PubChem, PC TRFRET-based biochemical high throughput dose response assay to identify inhibitors of 5-meCpG-binding domain protein 2 (MBD2)-DBD binding to methylated oligonucleotide PubChem Bioassay (2013)[AID] 
Target
Name:
Methyl-CpG-binding domain protein 2
Synonyms:
MBD2 Methyl-CpG binding domain protein 2 | Methyl-CpG-binding domain protein 2 (MBD2)
Type:
Enzyme Catalytic Domain
Mol. Mass.:
43278.74
Organism:
Homo sapiens (Human)
Description:
gi_21595776
Residue:
411
  
Inhibitor
Name:
BDBM83853
Synonyms:
7-chloranyl-2,3-dihydroimidazo[1,2-f]phenanthridine Imidazo[1,2-f]phenanthridine, 7-chloro-2,3-dihydro- SMR001798120 | cid_285027
Type:
Small organic molecule
Emp. Form.:
C15H11ClN2
Mol. Mass.:
254.714
SMILES:
Clc1ccc2N3CCN=C3c3ccccc3-c2c1
: