Target
PC4 and SFRS1-interacting protein
Ligand
BDBM60928
Substrate
Meas. Tech.
TR-FRET-based biochemical high throughput dose response assay to identify inhibitors of HIV-1 LEDGF/p75 DNA Integration
IC50
526.11±n/a nM
Citation
 PubChem, PC TR-FRET-based biochemical high throughput dose response assay to identify inhibitors of HIV-1 LEDGF/p75 DNA Integration PubChem Bioassay (2014)[AID] 
Target
Name:
PC4 and SFRS1-interacting protein
Synonyms:
DFS70 LEDGF/p75 PSIP1_HUMAN lens epithelium-derived growth factor p75
Type:
Enzyme Catalytic Domain
Mol. Mass.:
60120.68
Organism:
Homo sapiens (Human)
Description:
gi_6708281
Residue:
530
  
Inhibitor
Name:
BDBM60928
Synonyms:
BDBM50130192 L-DOPA dihydroxyphenylalanine
Type:
Emp. Form.:
C9H11NO4
Mol. Mass.:
197.1879
SMILES:
N[C@@H](Cc1ccc(O)c(O)c1)C(O)=O
: