Target
Tyrosine-protein kinase JAK3
Ligand
BDBM116319
Substrate
Meas. Tech.
JAK3 Inhibition Assay
pH
7.2±n/a
Temperature
295.15±n/a K
Ki
28.6±n/a nM
Comments
extracted
Citation
 Blaney, JGibbons, PAHanan, ELyssikatos, JPMagnuson, SRPastor, RRawson, TEZhou, AZhu, B Pyrazolopyrimidine JAK inhibitor compounds and methods US Patent  US8637526 Publication Date 1/28/2014 
Target
Name:
Tyrosine-protein kinase JAK3
Synonyms:
JAK-3 JAK3_HUMAN Janus kinase 3 (JAK3) L-JAK | Leukocyte janus kinase
Type:
Protein
Mol. Mass.:
125111.08
Organism:
Homo sapiens (Human)
Description:
P52333
Residue:
1124
  
Inhibitor
Name:
BDBM116319
Synonyms:
US8637526, 343
Type:
Small organic molecule
Emp. Form.:
C18H17N7O
Mol. Mass.:
347.3739
SMILES:
Cc1cc(NC(=O)c2cnn3ccc(N)nc23)n(n1)-c1ccccc1C
: