Target
Non-receptor tyrosine-protein kinase TYK2
Ligand
BDBM116319
Substrate
Meas. Tech.
JAK1 and TYK2 Inhibition Assay
pH
7.2±n/a
Ki
97.6±n/a nM
Comments
extracted
Citation
 Blaney, JGibbons, PAHanan, ELyssikatos, JPMagnuson, SRPastor, RRawson, TEZhou, AZhu, B Pyrazolopyrimidine JAK inhibitor compounds and methods US Patent  US8637526 Publication Date 1/28/2014 
Target
Name:
Non-receptor tyrosine-protein kinase TYK2
Synonyms:
Non-receptor tyrosine-protein kinase TYK2 (TYK2) TYK2_HUMAN | Tyrosine-protein kinase TYK2
Type:
Protein
Mol. Mass.:
133666.03
Organism:
Homo sapiens (Human)
Description:
P29597
Residue:
1187
  
Inhibitor
Name:
BDBM116319
Synonyms:
US8637526, 343
Type:
Small organic molecule
Emp. Form.:
C18H17N7O
Mol. Mass.:
347.3739
SMILES:
Cc1cc(NC(=O)c2cnn3ccc(N)nc23)n(n1)-c1ccccc1C
: