Target
TGF-beta receptor type-1
Ligand
BDBM283047
Substrate
Meas. Tech.
Biological Assay
pH
7.4±n/a
Temperature
298.15±n/a K
IC50
0.700±n/a nM
Comments
extracted
Citation
 Kinsella, TGelman, MHong, HDarwish, ISSingh, RYu, JBorzilleri, RMVelaparthi, ULiu, PDarne, CRahaman, HWarrier, JS TGF-beta inhibitors US Patent  US9884868 Publication Date 2/6/2018 
Target
Name:
TGF-beta receptor type-1
Synonyms:
ALK-5 Activin A receptor type II-like protein kinase of 53kD SKR4 TGF-beta receptor type I TGFBR1 TGFR1_HUMAN Transforming growth factor-beta receptor type I
Type:
enzyme
Mol. Mass.:
55968.24
Organism:
Homo sapiens (Human)
Description:
P36897
Residue:
503
  
Inhibitor
Name:
BDBM283047
Synonyms:
6-(1-(2,2-difluoroethyl)-4-(2-hydroxyphenyl)-1H- imidazol-5-yl)imidazo[1,2-b]pyridazine-3-carbonitrile US11352360, Example 248' | US9884868, Example 248'
Type:
Small organic molecule
Emp. Form.:
C18H12F2N6O
Mol. Mass.:
366.3243
SMILES:
Oc1ccccc1-c1ncn(CC(F)F)c1-c1ccc2ncc(C#N)n2n1
: