Target
P2X purinoceptor 3
Ligand
BDBM118142
Substrate
Meas. Tech.
Binding Assay
IC50
161±n/a nM
Citation
 Wei, ZKincaid, JKelly, MGO'Mahony, DJKaub, C Pyrid-2yl fused heterocyclic compounds, and compositions and uses thereof US Patent  US8653091 Publication Date 2/18/2014 
Target
Name:
P2X purinoceptor 3
Synonyms:
ATP receptor P2RX3 P2X purinoceptor 3 P2X purinoceptor 3 (P2X3) P2X3 purinoceptor p2x3 + hsa
Type:
Protein
Mol. Mass.:
44292.02
Organism:
Homo sapiens (Human)
Description:
P56373
Residue:
397
  
Inhibitor
Name:
BDBM118142
Synonyms:
US8653091, 37
Type:
Small organic molecule
Emp. Form.:
C21H23N5O
Mol. Mass.:
361.4402
SMILES:
Cc1ccc(nc1)N1CCc2ncnc(N[C@H](CO)c3ccccc3)c2C1
: