Target
P2X purinoceptor 3
Ligand
BDBM118159
Substrate
Meas. Tech.
Binding Assay
IC50
>10000±n/a nM
Citation
 Wei, ZKincaid, JKelly, MGO'Mahony, DJKaub, C Pyrid-2yl fused heterocyclic compounds, and compositions and uses thereof US Patent  US8653091 Publication Date 2/18/2014 
Target
Name:
P2X purinoceptor 3
Synonyms:
ATP receptor P2RX3 P2X purinoceptor 3 P2X purinoceptor 3 (P2X3) P2X3 purinoceptor p2x3 + hsa
Type:
Protein
Mol. Mass.:
44292.02
Organism:
Homo sapiens (Human)
Description:
P56373
Residue:
397
  
Inhibitor
Name:
BDBM118159
Synonyms:
US8653091, 54
Type:
Small organic molecule
Emp. Form.:
C22H20ClF3N6
Mol. Mass.:
460.883
SMILES:
FC(F)(F)c1ccc(cn1)[C@@H](Nc1ncnc2CCN(Cc12)c1ccc(Cl)cn1)C1CC1
: