Target
P2X purinoceptor 3
Ligand
BDBM118162
Substrate
Meas. Tech.
Binding Assay
IC50
103±n/a nM
Citation
 Wei, ZKincaid, JKelly, MGO'Mahony, DJKaub, C Pyrid-2yl fused heterocyclic compounds, and compositions and uses thereof US Patent  US8653091 Publication Date 2/18/2014 
Target
Name:
P2X purinoceptor 3
Synonyms:
ATP receptor P2RX3 P2X purinoceptor 3 P2X purinoceptor 3 (P2X3) P2X3 purinoceptor p2x3 + hsa
Type:
Protein
Mol. Mass.:
44292.02
Organism:
Homo sapiens (Human)
Description:
P56373
Residue:
397
  
Inhibitor
Name:
BDBM118162
Synonyms:
US8653091, 57
Type:
Small organic molecule
Emp. Form.:
C21H23ClN6O2
Mol. Mass.:
426.899
SMILES:
COc1ccc(cn1)[C@@H](CCO)Nc1ncnc2CCN(Cc12)c1ccc(Cl)cn1
: