Target
UDP-N-acetylglucosamine 1-carboxyvinyltransferase
Ligand
BDBM119068
Substrate
IC50
6e+3±n/a nM
Citation
 Hrast, MSosic, ISink, RGobec, S Inhibitors of the peptidoglycan biosynthesis enzymes MurA-F. Bioorg Chem 55:2-15 (2014)  
Target
Name:
UDP-N-acetylglucosamine 1-carboxyvinyltransferase
Synonyms:
EPT MURA_ECOLI UDP-N-acetylglucosamine 1-carboxyvinyltransferase murA | murZ
Type:
Protein
Mol. Mass.:
44814.62
Organism:
Escherichia coli K-12 (Enterobacteria)
Description:
E. coli MurA
Residue:
419
  
Inhibitor
Name:
BDBM119068
Synonyms:
Cpd1 (compound 3)
Type:
Small organic molecule
Emp. Form.:
C21H25NO2
Mol. Mass.:
323.4287
SMILES:
CN(C)CCC(=O)C(OCC=C)(c1ccccc1)c1ccccc1
: