Target
Cytochrome P450 3A4
Ligand
BDBM119125
Substrate
Meas. Tech.
Spectral Binding Titrations
pH
7.4±n/a
Kd
1.31e+4± 1.0e+3 nM
Comments
extracted
Citation
 Sevrioukova, IFPoulos, TL Dissecting cytochrome P450 3A4-ligand interactions using ritonavir analogues. Biochemistry 52:4474-81 (2013)  
Target
Name:
Cytochrome P450 3A4
Synonyms:
Albendazole monooxygenase CP3A4_HUMAN CYP3A4 CYPIIIA4 Cytochrome P450 3A4 (CYP3A4) Nifedipine oxidase Taurochenodeoxycholate 6-alpha-hydroxylase
Type:
Enzyme
Mol. Mass.:
57349.57
Organism:
Homo sapiens (Human)
Description:
Residue:
503
  
Inhibitor
Name:
BDBM119125
Synonyms:
GS4
Type:
Small organic molecule
Emp. Form.:
C23H36N6O4S2
Mol. Mass.:
524.7
SMILES:
CC(C)[C@H](NC(=O)N(C)Cc1csc(n1)C(C)C)C(=O)NCCCCNC(=O)OCc1cncs1
: