Target
Phosphatidylinositol 4,5-bisphosphate 3-kinase catalytic subunit beta isoform
Ligand
BDBM119231
Substrate
Meas. Tech.
Enzyme Inhibition Assay
IC50
2±n/a nM
Citation
 Barlaam, BCDegeorge, SLLambert-Van Der Brempt, CMMorgentin, RRPle, P Chromenone derivatives US Patent  US8673906 Publication Date 3/18/2014 
Target
Name:
Phosphatidylinositol 4,5-bisphosphate 3-kinase catalytic subunit beta isoform
Synonyms:
PI3-kinase p110 subunit beta PI3Kbeta PIK3CB Phosphatidylinositol 4,5-bisphosphate 3-kinase catalytic subunit beta (PI3Kbeta) Phosphatidylinositol 4,5-bisphosphate 3-kinase catalytic subunit beta isoform (PI3K) Phosphatidylinositol 4,5-bisphosphate 3-kinase catalytic subunit beta isoform (PI3Kbeta) Phosphatidylinositol-4,5-bisphosphate 3-kinase catalytic subunit beta isoform Phosphoinositide 3-Kinase (PI3K), beta Chain A PtdIns-3-kinase p110
Type:
Enzyme Subunit
Mol. Mass.:
122769.00
Organism:
Homo sapiens (Human)
Description:
P42338
Residue:
1070
  
Inhibitor
Name:
BDBM119231
Synonyms:
US8673906, 1.02 | US9718800, 1.02
Type:
Small organic molecule
Emp. Form.:
C26H32N4O4
Mol. Mass.:
464.5567
SMILES:
CC(Nc1ccccc1)c1cc(cc2c1oc(cc2=O)N1CCOCC1)C(=O)NCCN(C)C
: