Target
Fatty acid-binding protein, liver
Ligand
BDBM50085042
Substrate
Meas. Tech.
ANS Fluorescence Displacement Assay
Ki
15± 1 nM
Citation
 Martin, GGMcIntosh, ALHuang, HGupta, SAtshaves, BPLandrock, KKLandrock, DKier, ABSchroeder, F The human liver fatty acid binding protein T94A variant alters the structure, stability, and interaction with fibrates. Biochemistry 52:9347-57 (2013)  
Target
Name:
Fatty acid-binding protein, liver
Synonyms:
FABP1 FABPL_HUMAN Liver fatty acid binding protein (human L-FABP T94T)
Type:
Protein
Mol. Mass.:
14208.72
Organism:
Homo sapiens (Human)
Description:
human L-FABP
Residue:
127
  
Inhibitor
Name:
BDBM50085042
Synonyms:
2-(4-(4-Chlorobenzoyl)phenoxy)-2-methylpropanoic acid 1-methylethyl ester FENOFIBRATE Fenofibric acid Isopropyl (4'-(p-chlorobenzoyl)-2-phenoxy-2-methyl)propionate Lipantil (TN) Tricor (TN) | propan-2-yl 2-[4-(4-chlorobenzoyl)phenoxy]-2-methylpropanoate
Type:
Small organic molecule
Emp. Form.:
C20H21ClO4
Mol. Mass.:
360.831
SMILES:
CC(C)OC(=O)C(C)(C)Oc1ccc(cc1)C(=O)c1ccc(Cl)cc1
: