Target
Acetylcholinesterase
Ligand
BDBM120262
Substrate
Meas. Tech.
Assay of Substrate Hydrolysis
pH
7±n/a
Temperature
298.15±n/a K
Ki
250±0.0 nM
Comments
extracted
Citation
 Beri, VWildman, SAShiomi, KAl-Rashid, ZFCheung, JRosenberry, TL The natural product dihydrotanshinone I provides a prototype for uncharged inhibitors that bind specifically to the acetylcholinesterase peripheral site with nanomolar affinity. Biochemistry 52:7486-99 (2013)  
Target
Name:
Acetylcholinesterase
Synonyms:
ACES_MOUSE Acetylcholinesterase (mouse AChE) Ache
Type:
Enzyme
Mol. Mass.:
68165.65
Organism:
Mus musculus (mouse)
Description:
Residue:
614
  
Inhibitor
Name:
BDBM120262
Synonyms:
EDROPHONIUM BROMIDE Edrophonium cid_8307
Type:
Small organic molecule
Emp. Form.:
C10H16NO
Mol. Mass.:
166.2396
SMILES:
CC[N+](C)(C)c1cccc(O)c1
: