Target
Galectin-1
Ligand
BDBM120768
Substrate
Meas. Tech.
Fluorescence Polarization-Based Assay
Kd
>10000000±n/a nM
Citation
 Leffler, HNilsson, UJVon Wachenfeldt, H Galactoside inhibitors of galectins US Patent  US8703720 Publication Date 4/22/2014 
Target
Name:
Galectin-1
Synonyms:
14 kDa lectin HPL LGALS1 Lectin galactoside-binding soluble 1 | Putative MAPK-activating protein PM12
Type:
beta galactoside-binding protein
Mol. Mass.:
14713.53
Organism:
Homo sapiens (Human)
Description:
P09382
Residue:
135
  
Inhibitor
Name:
BDBM120768
Synonyms:
US8703720, Reference Compound 1
Type:
Small organic molecule
Emp. Form.:
C7H14O6
Mol. Mass.:
194.1825
SMILES:
CO[C@@H]1OC(CO)[C@H](O)[C@H](O)C1O
: