Target
Histone-lysine N-methyltransferase, H3 lysine-79 specific
Ligand
BDBM121395
Substrate
Meas. Tech.
Biochemical Assay
pH
8±n/a
Temperature
298.15±n/a K
IC50
<1000±n/a nM
Comments
extracted
Citation
 Chesworth, RKuntz, KWOlhava, EJPatane, MA 7-deazapurine modulators of histone methyltransferase, and methods of use thereof US Patent  US8722877 Publication Date 5/13/2014 
Target
Name:
Histone-lysine N-methyltransferase, H3 lysine-79 specific
Synonyms:
2.1.1.43 DOT1-like protein (Dot1L) DOT1L_HUMAN Histone H3-K79 methyltransferase Histone Methyltransferase DOT1L KIAA1814 Lysine N-methyltransferase 4
Type:
Protein
Mol. Mass.:
184911.91
Organism:
Homo sapiens (Human)
Description:
Q8TEK3
Residue:
1537
  
Inhibitor
Name:
BDBM121395
Synonyms:
US8722877, 21
Type:
Small organic molecule
Emp. Form.:
C27H37N7O5
Mol. Mass.:
539.6266
SMILES:
CC(=O)N(CCCNC(=O)Nc1ccc(cc1)C(C)(C)C)C[C@@H]1O[C@@H]([C@@H](O)[C@H]1O)n1ccc2c(N)ncnc12
: