Target
Vascular endothelial growth factor receptor 2
Ligand
BDBM4668
Substrate
poly(E,A,Y)
Meas. Tech.
VEGF-R Kinase Inhibition Assay
Temperature
298.15±n/a K
IC50
15±n/a nM
Comments
extracted
Citation
 Hennequin, LFStokes, ESThomas, APJohnstone, CPle, PAOgilvie, DJDukes, MWedge, SRKendrew, JCurwen, JO Novel 4-anilinoquinazolines with C-7 basic side chains: design and structure activity relationship of a series of potent, orally active, VEGF receptor tyrosine kinase inhibitors. J Med Chem 45:1300-12 (2002)  
Target
Name:
Vascular endothelial growth factor receptor 2
Synonyms:
CD_antigen=CD309 Fetal liver kinase 1 (FLK-1) KDR Protein-tyrosine kinase receptor Flk-1 VEGFR-2 VEGFR2 Vascular Endothelial Growth Factor Receptor Kinase 2 Vascular endothelial growth factor receptor 2 (KDR) Vascular endothelial growth factor receptor 2 (VEGFR2) Vascular endothelial growth factor receptor-2 (VEGFR-2)
Type:
Receptor Tyrosine Kinase
Mol. Mass.:
151510.97
Organism:
Homo sapiens (Human)
Description:
P35968
Residue:
1356
  
Inhibitor
Name:
BDBM4668
Synonyms:
4-Anilinoquinazoline 15 | N-(4-chloro-2-fluorophenyl)-6-methoxy-7-[(1-methylpiperidin-4-yl)methoxy]quinazolin-4-amine
Type:
Small organic molecule
Emp. Form.:
C22H24ClFN4O2
Mol. Mass.:
430.903
SMILES:
COc1cc2c(Nc3ccc(Cl)cc3F)ncnc2cc1OCC1CCN(C)CC1
:
Substrate
Name:
poly(E,A,Y)
Synonyms:
Type:
Random Copolymer
Mol. Mass.:
358.43
Organism:
Description:
A poly(glu, ala, tyr) 6:3:1 random copolymer. 2 uM ATP was used as co-substrate.
Residue:
3
NA