Target
Epidermal growth factor receptor
Ligand
BDBM4658
Substrate
poly(E,A,Y)
Meas. Tech.
VEGF-R Kinase Inhibition Assay
Temperature
298.15±n/a K
IC50
100±n/a nM
Comments
extracted
Citation
 Hennequin, LFStokes, ESThomas, APJohnstone, CPle, PAOgilvie, DJDukes, MWedge, SRKendrew, JCurwen, JO Novel 4-anilinoquinazolines with C-7 basic side chains: design and structure activity relationship of a series of potent, orally active, VEGF receptor tyrosine kinase inhibitors. J Med Chem 45:1300-12 (2002)  
Target
Name:
Epidermal growth factor receptor
Synonyms:
EGF Receptor Substrate EGFR_HUMAN ERBB1 Epidermal Growth Factor Receptor erbB-1 Epidermal growth factor receptor (EGFR) HER1 Proto-oncogene c-ErbB-1 Tyrosine-Protein Kinase ErbB-1
Type:
Receptor Kinase Domain
Mol. Mass.:
134279.59
Organism:
Homo sapiens (Human)
Description:
P00533
Residue:
1210
  
Inhibitor
Name:
BDBM4658
Synonyms:
4-Anilinoquinazoline 5 | N-(4-bromo-2-fluorophenyl)-6-methoxy-7-[3-(4-methylpiperazin-1-yl)propoxy]quinazolin-4-amine
Type:
Small organic molecule
Emp. Form.:
C23H27BrFN5O2
Mol. Mass.:
504.395
SMILES:
COc1cc2c(Nc3ccc(Br)cc3F)ncnc2cc1OCCCN1CCN(C)CC1
:
Substrate
Name:
poly(E,A,Y)
Synonyms:
Type:
Random Copolymer
Mol. Mass.:
358.43
Organism:
Description:
A poly(glu, ala, tyr) 6:3:1 random copolymer. 2 uM ATP was used as co-substrate.
Residue:
3
NA