Target
Tyrosine-protein kinase SYK
Ligand
BDBM121794
Substrate
Meas. Tech.
Mobility-Shift kinase assay
IC50
101±n/a nM
Citation
 Che, JDing, QHe, XLiu, HLiu, YMichellys, POkram, BWu, XYang, KZhu, X Compounds and compositions as Syk kinase inhibitors US Patent  US8722692 Publication Date 5/13/2014 
Target
Name:
Tyrosine-protein kinase SYK
Synonyms:
KSYK_HUMAN Spleen Tyrosine Kinase Tyrosine-protein kinase SYK (Syk)
Type:
Enzyme
Mol. Mass.:
72079.99
Organism:
Homo sapiens (Human)
Description:
P43405
Residue:
635
  
Inhibitor
Name:
BDBM121794
Synonyms:
US8722692, 233
Type:
Small organic molecule
Emp. Form.:
C23H29N5O
Mol. Mass.:
391.5093
SMILES:
CC(C)Nc1nc(cc2ncn(C)c(=O)c12)-c1ccc(CCN2CCCC2)cc1
: