Target
Tyrosine-protein kinase BTK
Ligand
BDBM122416
Substrate
Meas. Tech.
Inhibition Assay
pH
7.2±n/a
IC50
0.36±n/a nM
Comments
extracted
Citation
 Billedeau, RJKondru, RKLopez-Tapia, FJLou, YOwens, TDQian, YSo, SThakkar, KCWanner, JMorales, OJ Inhibitors of bruton's tyrosine kinase US Patent  US8729078 Publication Date 5/20/2014 
Target
Name:
Tyrosine-protein kinase BTK
Synonyms:
AGMX1 Agammaglobulinaemia tyrosine kinase B cell progenitor kinase BPK BTK_HUMAN Tyrosine Kinase BTK Tyrosine-protein kinase BTK (BTK)
Type:
Enzyme
Mol. Mass.:
76289.95
Organism:
Homo sapiens (Human)
Description:
Q06187
Residue:
659
  
Inhibitor
Name:
BDBM122416
Synonyms:
US8729078, I-26
Type:
Small organic molecule
Emp. Form.:
C28H26FN7O3
Mol. Mass.:
527.5495
SMILES:
CC(C)(C)c1cc(F)c2c(cnn(-c3cccc(c3CO)-n3cc(C(N)=O)c(Nc4ccccn4)n3)c2=O)c1
: