Target
High affinity cGMP-specific 3',5'-cyclic phosphodiesterase 9A
Ligand
BDBM123691
Substrate
Meas. Tech.
In Vitro Inhibition Assay
pH
7.5±n/a
IC50
86±n/a nM
Comments
extracted
Citation
 Hendrix, MBöβ, FBurkhardt, NErb, CTersteegen, AVan Kampen, M Alkyl-substituted pyrazolopyrimidines US Patent  US8741907 Publication Date 6/3/2014 
Target
Name:
High affinity cGMP-specific 3',5'-cyclic phosphodiesterase 9A
Synonyms:
3',5'-cyclic phosphodiesterase PDE9A_HUMAN Phosphodiesterase 9A (PDE9) | Phosphodiesterase 9A (PDE9A)
Type:
Protein
Mol. Mass.:
68488.40
Organism:
Homo sapiens (Human)
Description:
O76083
Residue:
593
  
Inhibitor
Name:
BDBM123691
Synonyms:
US8741907, 17
Type:
Small organic molecule
Emp. Form.:
C15H20N4O2
Mol. Mass.:
288.3449
SMILES:
O=c1[nH]c(CC2CCCO2)nc2n(ncc12)C1CCCC1
: