Target
Dipeptidyl peptidase 4
Ligand
BDBM123770
Substrate
Meas. Tech.
Inhibition of DDP IV In Vitro
pH
7.5±n/a
IC50
156±24 nM
Comments
extracted
Citation
 Xing, JLi, QZhang, SLiu, HZhao, LCheng, HZhang, YZhou, JZhang, H Identification of dipeptidyl peptidase IV inhibitors: virtual screening, synthesis and biological evaluation. Chem Biol Drug Des 84:364-77 (2014)  
Target
Name:
Dipeptidyl peptidase 4
Synonyms:
ADABP Adenosine deaminase complexing protein 2 CD_antigen=CD26 DPP4 DPPIV Dipeptidyl peptidase 4 (DPP IV) Dipeptidyl peptidase 4 (DPP4) Dipeptidyl peptidase 4 membrane form Dipeptidyl peptidase IV Dipeptidyl peptidase IV (DDP-IV) Dipeptidyl peptidase IV membrane form Dipeptidyl peptidase-IV (DPP-4) T-cell activation antigen CD26 | TP103
Type:
Enzyme
Mol. Mass.:
88271.01
Organism:
Homo sapiens (Human)
Description:
P27487
Residue:
766
  
Inhibitor
Name:
BDBM123770
Synonyms:
N-(4-Chlorophenyl)-2-((2-(6,7-dimethoxy- 3,4-dihydroisoquinolin-2(1H)-yl)-2-oxoethyl) amino)acetamide (35b)
Type:
Small organic molecule
Emp. Form.:
C21H24ClN3O4
Mol. Mass.:
417.886
SMILES:
COc1cc2CCN(Cc2cc1OC)C(=O)CNCC(=O)Nc1ccc(Cl)cc1
: