Target
Dipeptidyl peptidase 4
Ligand
BDBM50228397
Substrate
Meas. Tech.
HypoGen Pharmaphore Generation
IC50
3±0.0 nM
Citation
 Xing, JLi, QZhang, SLiu, HZhao, LCheng, HZhang, YZhou, JZhang, H Identification of dipeptidyl peptidase IV inhibitors: virtual screening, synthesis and biological evaluation. Chem Biol Drug Des 84:364-77 (2014)  
Target
Name:
Dipeptidyl peptidase 4
Synonyms:
ADABP Adenosine deaminase complexing protein 2 CD_antigen=CD26 DPP4 DPPIV Dipeptidyl peptidase 4 (DPP IV) Dipeptidyl peptidase 4 (DPP4) Dipeptidyl peptidase 4 membrane form Dipeptidyl peptidase IV Dipeptidyl peptidase IV (DDP-IV) Dipeptidyl peptidase IV membrane form Dipeptidyl peptidase-IV (DPP-4) T-cell activation antigen CD26 | TP103
Type:
Enzyme
Mol. Mass.:
88271.01
Organism:
Homo sapiens (Human)
Description:
P27487
Residue:
766
  
Inhibitor
Name:
BDBM50228397
Synonyms:
8-((S)-3-amino-piperidin-1-yl)-3-methyl-7-(3-methyl-but-2-enyl)-1-(2-oxo-2-phenyl-ethyl)-3,7-dihydro-purine-2,6-dione CHEMBL237067 (9)
Type:
Small organic molecule
Emp. Form.:
C24H30N6O3
Mol. Mass.:
450.5334
SMILES:
[#6]\[#6](-[#6])=[#6]\[#6]-n1c(nc2n(-[#6])c(=O)n(-[#6]-[#6](=O)-c3ccccc3)c(=O)c12)-[#7]-1-[#6]-[#6]-[#6]-[#6@H](-[#7])-[#6]-1
: