Target
Dipeptidyl peptidase 4
Ligand
BDBM11162
Substrate
Meas. Tech.
HypoGen Pharmaphore Generation
IC50
18±0.0 nM
Citation
 Xing, JLi, QZhang, SLiu, HZhao, LCheng, HZhang, YZhou, JZhang, H Identification of dipeptidyl peptidase IV inhibitors: virtual screening, synthesis and biological evaluation. Chem Biol Drug Des 84:364-77 (2014)  
Target
Name:
Dipeptidyl peptidase 4
Synonyms:
ADABP Adenosine deaminase complexing protein 2 CD_antigen=CD26 DPP4 DPPIV Dipeptidyl peptidase 4 (DPP IV) Dipeptidyl peptidase 4 (DPP4) Dipeptidyl peptidase 4 membrane form Dipeptidyl peptidase IV Dipeptidyl peptidase IV (DDP-IV) Dipeptidyl peptidase IV membrane form Dipeptidyl peptidase-IV (DPP-4) T-cell activation antigen CD26 | TP103
Type:
Enzyme
Mol. Mass.:
88271.01
Organism:
Homo sapiens (Human)
Description:
P27487
Residue:
766
  
Inhibitor
Name:
BDBM11162
Synonyms:
(1R)-3-oxo-3-[3-(trifluoroethyl)-5,6-dihydro[1,2,4]triazolo[4,3-a]pyrazin-7(8H)-yl]-1-(2,4,5-trifluorobenzyl)propylamine CHEMBL393336 Sitagliptin Triazolopiperazine Analogue 1 | US10479798, Compound MK0431
Type:
Small organic molecule
Emp. Form.:
C16H15F6N5O
Mol. Mass.:
407.3136
SMILES:
N[C@@H](CC(=O)N1CCn2c(C1)nnc2C(F)(F)F)Cc1cc(F)c(F)cc1F
: