Target
Dipeptidyl peptidase 4
Ligand
BDBM50151805
Substrate
Meas. Tech.
HypoGen Pharmaphore Generation
IC50
3000±0.0 nM
Citation
 Xing, JLi, QZhang, SLiu, HZhao, LCheng, HZhang, YZhou, JZhang, H Identification of dipeptidyl peptidase IV inhibitors: virtual screening, synthesis and biological evaluation. Chem Biol Drug Des 84:364-77 (2014)  
Target
Name:
Dipeptidyl peptidase 4
Synonyms:
ADABP Adenosine deaminase complexing protein 2 CD_antigen=CD26 DPP4 DPPIV Dipeptidyl peptidase 4 (DPP IV) Dipeptidyl peptidase 4 (DPP4) Dipeptidyl peptidase 4 membrane form Dipeptidyl peptidase IV Dipeptidyl peptidase IV (DDP-IV) Dipeptidyl peptidase IV membrane form Dipeptidyl peptidase-IV (DPP-4) T-cell activation antigen CD26 | TP103
Type:
Enzyme
Mol. Mass.:
88271.01
Organism:
Homo sapiens (Human)
Description:
P27487
Residue:
766
  
Inhibitor
Name:
BDBM50151805
Synonyms:
(R)-3-Amino-4-phenyl-1-thiazolidin-3-yl-butan-1-one CHEMBL184262 (24)
Type:
Small organic molecule
Emp. Form.:
C13H18N2OS
Mol. Mass.:
250.36
SMILES:
N[C@@H](CC(=O)N1CCSC1)Cc1ccccc1
: