Target
Dipeptidyl peptidase 4
Ligand
BDBM123784
Substrate
Meas. Tech.
HypoGen Pharmaphore Generation
IC50
7200±0.0 nM
Citation
 Xing, JLi, QZhang, SLiu, HZhao, LCheng, HZhang, YZhou, JZhang, H Identification of dipeptidyl peptidase IV inhibitors: virtual screening, synthesis and biological evaluation. Chem Biol Drug Des 84:364-77 (2014)  
Target
Name:
Dipeptidyl peptidase 4
Synonyms:
ADABP Adenosine deaminase complexing protein 2 CD_antigen=CD26 DPP4 DPPIV Dipeptidyl peptidase 4 (DPP IV) Dipeptidyl peptidase 4 (DPP4) Dipeptidyl peptidase 4 membrane form Dipeptidyl peptidase IV Dipeptidyl peptidase IV (DDP-IV) Dipeptidyl peptidase IV membrane form Dipeptidyl peptidase-IV (DPP-4) T-cell activation antigen CD26 | TP103
Type:
Enzyme
Mol. Mass.:
88271.01
Organism:
Homo sapiens (Human)
Description:
P27487
Residue:
766
  
Inhibitor
Name:
BDBM123784
Synonyms:
(2S)-2-[4-({[(2S)-1-[(2S)-2-amino-2- cyclohexylacetyl]pyrrolidin-2- yl]formamido}methyl)phenoxy]-3-methylbutanoic acid (25)
Type:
Small organic molecule
Emp. Form.:
C25H37N3O5
Mol. Mass.:
459.5784
SMILES:
CC(C)[C@H](Oc1ccc(CNC(=O)[C@@H]2CCCN2C(=O)[C@@H](N)C2CCCCC2)cc1)C(O)=O
: