Target
Tyrosine-protein phosphatase non-receptor type 2
Ligand
BDBM124232
Substrate
Meas. Tech.
Inhibitor Assay
Temperature
303.15±0 K
IC50
6.4e+3±n/a nM
Citation
 Song, ZHe, XPLi, CGao, LXWang, ZXTang, YXie, JLi, JChen, GR Preparation of triazole-linked glycosylated ??????-ketocarboxylic acid derivatives as new PTP1B inhibitors. Carbohydr Res 346:140-5 (2011)  
Target
Name:
Tyrosine-protein phosphatase non-receptor type 2
Synonyms:
PTN2_HUMAN PTPT T-cell protein-tyrosine phosphatase TCPTP Tyrosine-protein phosphatase non-receptor type 2 (TC-PTP)
Type:
Protein
Mol. Mass.:
48481.80
Organism:
Homo sapiens (Human)
Description:
P17706
Residue:
415
  
Inhibitor
Name:
BDBM124232
Synonyms:
1-(4-(Carboxycarbonyl)phenyl)-1H-1,2,3-triazol-4- ylmethyl 2,3,4,6-tetra-O-benzyl a-D-glucopyranoside (19)
Type:
Small organic molecule
Emp. Form.:
C45H43N3O9
Mol. Mass.:
769.8376
SMILES:
OC(=O)C(=O)c1ccc(cc1)-n1cc(CO[C@H]2O[C@H](COCc3ccccc3)[C@@H](OCc3ccccc3)[C@H](OCc3ccccc3)[C@H]2OCc2ccccc2)nn1
: