Target
Receptor-type tyrosine-protein phosphatase F
Ligand
BDBM124228
Substrate
Meas. Tech.
Inhibitor Assay
Temperature
303.15±0 K
IC50
>1.00e+5±n/a nM
Citation
 Song, ZHe, XPLi, CGao, LXWang, ZXTang, YXie, JLi, JChen, GR Preparation of triazole-linked glycosylated ??????-ketocarboxylic acid derivatives as new PTP1B inhibitors. Carbohydr Res 346:140-5 (2011)  
Target
Name:
Receptor-type tyrosine-protein phosphatase F
Synonyms:
LAR Leukocyte common antigen related (LAR) PTPRF_HUMAN Receptor-type tyrosine-protein phosphatase F (LAR)
Type:
Protein
Mol. Mass.:
212869.85
Organism:
Homo sapiens (Human)
Description:
P10586
Residue:
1907
  
Inhibitor
Name:
BDBM124228
Synonyms:
Methyl 2,3,4-tri-O-benzyl-6-O-[1-(4- (carboxycarbonyl)phenyl)-1H-1,2,3-triazol-4-ylmethyl] a-D-glucopyranoside (15)
Type:
Small organic molecule
Emp. Form.:
C39H39N3O9
Mol. Mass.:
693.7417
SMILES:
CO[C@H]1O[C@H](COCc2cn(nn2)-c2ccc(cc2)C(=O)C(O)=O)[C@@H](OCc2ccccc2)[C@H](OCc2ccccc2)[C@H]1OCc1ccccc1
: