Target
Tyrosine-protein phosphatase non-receptor type 1
Ligand
BDBM124233
Substrate
Meas. Tech.
pNPP assay
IC50
1.927e+4± 1.80e+3 nM
Citation
 Wang, WLHuang, CGao, LXTang, CLWang, JQWu, MCSheng, LChen, HJNan, FJLi, JYLi, JFeng, B Synthesis and biological evaluation of novel bis-aromatic amides as novel PTP1B inhibitors. Bioorg Med Chem Lett 24:1889-94 (2014)  
Target
Name:
Tyrosine-protein phosphatase non-receptor type 1
Synonyms:
PTN1_HUMAN PTPN1 Protein tyrosine phosphatase-1B (PTP1B) Protein-tyrosine phosphatase 1B (PTP1B) Tyrosine-protein phosphatase non-receptor type 1 (PTP1B)
Type:
Protein phosphatase
Mol. Mass.:
49963.76
Organism:
Homo sapiens (Human)
Description:
Human recombinant GST-fusion PTP1B (1-435).
Residue:
435
  
Inhibitor
Name:
BDBM124233
Synonyms:
N‐{4‐[4‐(furan‐2‐amido)phenyl]phenyl}furan‐2‐ carboxamide (1)
Type:
Small organic molecule
Emp. Form.:
C22H16N2O4
Mol. Mass.:
372.3734
SMILES:
O=C(Nc1ccc(cc1)-c1ccc(NC(=O)c2ccco2)cc1)c1ccco1
: