Target
Tyrosine-protein phosphatase non-receptor type 1
Ligand
BDBM124241
Substrate
Meas. Tech.
pNPP assay
IC50
2.34e+3± 8e+1 nM
Citation
 Wang, WLHuang, CGao, LXTang, CLWang, JQWu, MCSheng, LChen, HJNan, FJLi, JYLi, JFeng, B Synthesis and biological evaluation of novel bis-aromatic amides as novel PTP1B inhibitors. Bioorg Med Chem Lett 24:1889-94 (2014)  
Target
Name:
Tyrosine-protein phosphatase non-receptor type 1
Synonyms:
PTN1_HUMAN PTPN1 Protein tyrosine phosphatase-1B (PTP1B) Protein-tyrosine phosphatase 1B (PTP1B) Tyrosine-protein phosphatase non-receptor type 1 (PTP1B)
Type:
Protein phosphatase
Mol. Mass.:
49963.76
Organism:
Homo sapiens (Human)
Description:
Human recombinant GST-fusion PTP1B (1-435).
Residue:
435
  
Inhibitor
Name:
BDBM124241
Synonyms:
N,N'-([1,1'-biphenyl]-4,4'-diyl)bis(1-(furan-2-carbonyl)piperidine-4-carboxamide) (15)
Type:
Small organic molecule
Emp. Form.:
C34H34N4O6
Mol. Mass.:
594.657
SMILES:
O=C(Nc1ccc(cc1)-c1ccc(NC(=O)C2CCN(CC2)C(=O)c2ccco2)cc1)C1CCN(CC1)C(=O)c1ccco1
: