Target
Tyrosine-protein phosphatase non-receptor type 1
Ligand
BDBM124242
Substrate
Meas. Tech.
pNPP assay
IC50
1.463e+4± 3.50e+3 nM
Citation
 Wang, WLHuang, CGao, LXTang, CLWang, JQWu, MCSheng, LChen, HJNan, FJLi, JYLi, JFeng, B Synthesis and biological evaluation of novel bis-aromatic amides as novel PTP1B inhibitors. Bioorg Med Chem Lett 24:1889-94 (2014)  
Target
Name:
Tyrosine-protein phosphatase non-receptor type 1
Synonyms:
PTN1_HUMAN PTPN1 Protein tyrosine phosphatase-1B (PTP1B) Protein-tyrosine phosphatase 1B (PTP1B) Tyrosine-protein phosphatase non-receptor type 1 (PTP1B)
Type:
Protein phosphatase
Mol. Mass.:
49963.76
Organism:
Homo sapiens (Human)
Description:
Human recombinant GST-fusion PTP1B (1-435).
Residue:
435
  
Inhibitor
Name:
BDBM124242
Synonyms:
N,N'-([1,1'-biphenyl]-4,4'-diyl)bis(1-(cyclohexanecarbonyl)piperidine-4-carboxamide) (16)
Type:
Small organic molecule
Emp. Form.:
C38H50N4O4
Mol. Mass.:
626.828
SMILES:
O=C(Nc1ccc(cc1)-c1ccc(NC(=O)C2CCN(CC2)C(=O)C2CCCCC2)cc1)C1CCN(CC1)C(=O)C1CCCCC1
: