Target
Tyrosine-protein phosphatase non-receptor type 1
Ligand
BDBM124244
Substrate
Meas. Tech.
pNPP assay
IC50
1.854e+4± 3.49e+3 nM
Citation
 Wang, WLHuang, CGao, LXTang, CLWang, JQWu, MCSheng, LChen, HJNan, FJLi, JYLi, JFeng, B Synthesis and biological evaluation of novel bis-aromatic amides as novel PTP1B inhibitors. Bioorg Med Chem Lett 24:1889-94 (2014)  
Target
Name:
Tyrosine-protein phosphatase non-receptor type 1
Synonyms:
PTN1_HUMAN PTPN1 Protein tyrosine phosphatase-1B (PTP1B) Protein-tyrosine phosphatase 1B (PTP1B) Tyrosine-protein phosphatase non-receptor type 1 (PTP1B)
Type:
Protein phosphatase
Mol. Mass.:
49963.76
Organism:
Homo sapiens (Human)
Description:
Human recombinant GST-fusion PTP1B (1-435).
Residue:
435
  
Inhibitor
Name:
BDBM124244
Synonyms:
N-phenyl-4-[4-(phenylcarbamoyl)phenyl]benzamide (20)
Type:
Small organic molecule
Emp. Form.:
C26H20N2O2
Mol. Mass.:
392.4492
SMILES:
O=C(Nc1ccccc1)c1ccc(cc1)-c1ccc(cc1)C(=O)Nc1ccccc1
: