Target
Phosphatidylinositol 4,5-bisphosphate 3-kinase catalytic subunit delta isoform
Ligand
BDBM284877
Substrate
Meas. Tech.
ADP-Glo Format PI3K Assays
pH
7.5±n/a
Temperature
298.15±n/a K
IC50
5.00±n/a nM
Comments
extracted
Citation
 Bhide, RSRuan, ZCherney, RJCornelius, LADhar, TGGong, HMarcoux, DPoss, MAQin, LShi, QTino, JA Heteroaryl substituted pyrrolotriazine amine compounds as PI3K inhibitors US Patent  US10023576 Publication Date 7/17/2018 
Target
Name:
Phosphatidylinositol 4,5-bisphosphate 3-kinase catalytic subunit delta isoform
Synonyms:
PI3-kinase p110 subunit delta PI3-kinase subunit p110-delta PIK3CD Phosphatidylinositol 4,5-biphosphate 3-kinase catalytic subunit delta (PIK3CD) Phosphatidylinositol 4,5-bisphosphate 3-kinase 110 kDa catalytic subunit delta (PI3K delta) Phosphatidylinositol 4,5-bisphosphate 3-kinase catalytic subunit delta (PI3Kdelta) Phosphatidylinositol 4,5-bisphosphate 3-kinase catalytic subunit delta isoform (PI3K delta) Phosphatidylinositol 4,5-bisphosphate 3-kinase catalytic subunit delta isoform (PI3K-delta) Phosphatidylinositol 4,5-bisphosphate 3-kinase catalytic subunit delta isoform (PI3Kdelta)
Type:
Enzyme Subunit
Mol. Mass.:
119489.41
Organism:
Homo sapiens (Human)
Description:
O00329
Residue:
1044
  
Inhibitor
Name:
BDBM284877
Synonyms:
7-(2-(2-(Methylsulfonyl)phenyl)pyridin-4-yl)-5-(1-(tetrahydro-2H-pyran-4-yl)-1H-pyrazol-5-yl)pyrrolo[2,1-f][1,2,4]triazin-4-amine | US10023576, Example 68
Type:
Small organic molecule
Emp. Form.:
C26H25N7O3S
Mol. Mass.:
515.587
SMILES:
CS(=O)(=O)c1ccccc1-c1cc(ccn1)-c1cc(-c2ccnn2C2CCOCC2)c2c(N)ncnn12
: