Target
Serine/threonine-protein kinase 10
Ligand
BDBM124970
Substrate
Meas. Tech.
Kinase Screen Assay
Kd
9.5±n/a nM
Citation
 Choi, HGSim, TGray, NZhou, WChang, JWZhang, JWeisberg, E Fused 2-aminothiazole compounds US Patent  US8765747 Publication Date 7/1/2014 
Target
Name:
Serine/threonine-protein kinase 10
Synonyms:
LOK STK10_HUMAN Serine/threonine-protein kinase 10 (STK10)
Type:
Protein
Mol. Mass.:
112139.54
Organism:
Homo sapiens (Human)
Description:
O94804
Residue:
968
  
Inhibitor
Name:
BDBM124970
Synonyms:
US8765747, 2
Type:
Small organic molecule
Emp. Form.:
C31H31F3N6O2S
Mol. Mass.:
608.677
SMILES:
CCN1CCN(Cc2ccc(NC(=O)c3cccc(c3)-c3ccc4nc(NC(=O)C5CC5)sc4n3)cc2C(F)(F)F)CC1
: