Target
Calcitonin gene-related peptide 1
Ligand
BDBM126173
Substrate
Meas. Tech.
Binding Assay
pH
7.4±n/a
Temperature
298.15±n/a K
Ki
0.34±n/a nM
Comments
extracted
Citation
 Stump, CAQuigley, AG CGRP receptor antagonists US Patent  US8778957 Publication Date 7/15/2014 
Target
Name:
Calcitonin gene-related peptide 1
Synonyms:
CALC1 CALCA_HUMAN Calcitonin gene-related peptide (CGRP alpha) | Calcitonin gene-related peptide 1
Type:
Enzyme
Mol. Mass.:
13902.80
Organism:
Homo sapiens (Human)
Description:
P06881
Residue:
128
  
Inhibitor
Name:
BDBM126173
Synonyms:
US8778957, 87
Type:
Small organic molecule
Emp. Form.:
C34H33N5O2
Mol. Mass.:
543.6581
SMILES:
O=C1Nc2ncccc2[C@@]11Cc2cc3ccc(CN4CC5(CCCC5)NC(=O)C4Cc4ccccc4)nc3cc2C1
: