Target
Calcitonin gene-related peptide 1
Ligand
BDBM126187
Substrate
Meas. Tech.
Binding Assay
pH
7.4±n/a
Temperature
298.15±n/a K
Ki
1100±n/a nM
Comments
extracted
Citation
 Stump, CAQuigley, AG CGRP receptor antagonists US Patent  US8778957 Publication Date 7/15/2014 
Target
Name:
Calcitonin gene-related peptide 1
Synonyms:
CALC1 CALCA_HUMAN Calcitonin gene-related peptide (CGRP alpha) | Calcitonin gene-related peptide 1
Type:
Enzyme
Mol. Mass.:
13902.80
Organism:
Homo sapiens (Human)
Description:
P06881
Residue:
128
  
Inhibitor
Name:
BDBM126187
Synonyms:
US8778957, 147
Type:
Small organic molecule
Emp. Form.:
C29H31N3O2
Mol. Mass.:
453.5753
SMILES:
CC1C(=O)NC(=O)C11Cc2cc3ccc(CN4CCC(Cc5ccccc5)CC4)nc3cc2C1
: