Target
Calcitonin gene-related peptide 1
Ligand
BDBM126186
Substrate
Meas. Tech.
Binding Assay
pH
7.4±n/a
Temperature
298.15±n/a K
Ki
7400±n/a nM
Comments
extracted
Citation
 Stump, CAQuigley, AG CGRP receptor antagonists US Patent  US8778957 Publication Date 7/15/2014 
Target
Name:
Calcitonin gene-related peptide 1
Synonyms:
CALC1 CALCA_HUMAN Calcitonin gene-related peptide (CGRP alpha) | Calcitonin gene-related peptide 1
Type:
Enzyme
Mol. Mass.:
13902.80
Organism:
Homo sapiens (Human)
Description:
P06881
Residue:
128
  
Inhibitor
Name:
BDBM126186
Synonyms:
US8778957, 115
Type:
Small organic molecule
Emp. Form.:
C31H28N4O2
Mol. Mass.:
488.5796
SMILES:
O=C1Nc2ncccc2C11Cc2cc3ccc(CN4CCC5(CC4)OCc4ccccc54)nc3cc2C1
: