Target
RAC-beta serine/threonine-protein kinase
Ligand
BDBM126557
Substrate
Meas. Tech.
Kinase Inhibition Assay
pH
7.5±n/a
IC50
0.29±n/a nM
Comments
extracted
Citation
 Nakamura, MNiiyama, KKamijo, KOhkubo, MShimomura, T Imidazo-oxazine compound or salt thereof US Patent  US8772283 Publication Date 7/8/2014 
Target
Name:
RAC-beta serine/threonine-protein kinase
Synonyms:
AKT2 PKB beta Protein kinase B (Akt 2) Protein kinase B, beta RAC-alpha serine/threonine-protein kinase (AKT2) RAC-beta serine/threonine-protein kinase (AKT2) Serine/threonine-protein kinase AKT2 | Serine/threonine-protein kinase Rac alpha/beta
Type:
Enzyme
Mol. Mass.:
55766.64
Organism:
Homo sapiens (Human)
Description:
Residue:
481
  
Inhibitor
Name:
BDBM126557
Synonyms:
US8772283, 1
Type:
Small organic molecule
Emp. Form.:
C29H26FN3O2
Mol. Mass.:
467.534
SMILES:
NC1(CC(O)(C1)C1CC1)c1ccc(cc1)-c1nc2-c3c(F)cccc3OCn2c1-c1ccccc1
: