Target
RAC-beta serine/threonine-protein kinase
Ligand
BDBM126581
Substrate
Meas. Tech.
Kinase Inhibition Assay
pH
7.5±n/a
IC50
0.27±n/a nM
Comments
extracted
Citation
 Nakamura, MNiiyama, KKamijo, KOhkubo, MShimomura, T Imidazo-oxazine compound or salt thereof US Patent  US8772283 Publication Date 7/8/2014 
Target
Name:
RAC-beta serine/threonine-protein kinase
Synonyms:
AKT2 PKB beta Protein kinase B (Akt 2) Protein kinase B, beta RAC-alpha serine/threonine-protein kinase (AKT2) RAC-beta serine/threonine-protein kinase (AKT2) Serine/threonine-protein kinase AKT2 | Serine/threonine-protein kinase Rac alpha/beta
Type:
Enzyme
Mol. Mass.:
55766.64
Organism:
Homo sapiens (Human)
Description:
Residue:
481
  
Inhibitor
Name:
BDBM126581
Synonyms:
US8772283, 25
Type:
Small organic molecule
Emp. Form.:
C31H31N3O4
Mol. Mass.:
509.5955
SMILES:
COc1cc(OC)c2-c3nc(c(-c4ccccc4)n3COc2c1)-c1ccc(cc1)C1(N)CC(O)(C1)C1CC1
: