Target
RNA-editing ligase 1, mitochondrial
Ligand
BDBM55182
Substrate
Meas. Tech.
Fluorescence-based biochemical high throughput dose response assay to identify inhibitors of Trypanosoma brucei RNA editing ligase 1 (TbREL1).
IC50
63776±n/a nM
Citation
 PubChem, PC Fluorescence-based biochemical high throughput dose response assay to identify inhibitors of Trypanosoma brucei RNA editing ligase 1 (TbREL1). PubChem Bioassay (2014)[AID] 
Target
Name:
RNA-editing ligase 1, mitochondrial
Synonyms:
REL1 Trypanosoma brucei RNA editing ligase 1
Type:
Enzyme Catalytic Domain
Mol. Mass.:
52299.36
Organism:
Trypanosoma brucei brucei
Description:
gi_342179211
Residue:
469
  
Inhibitor
Name:
BDBM55182
Synonyms:
5-[[5-(4-fluoranyl-2-oxidanyl-phenyl)furan-2-yl]methylidene]-1,3-diazinane-2,4,6-trione 5-[[5-(4-fluoro-2-hydroxyphenyl)-2-furanyl]methylidene]-1,3-diazinane-2,4,6-trione MLS000911621 cid_24856274
Type:
Small organic molecule
Emp. Form.:
C15H9FN2O5
Mol. Mass.:
316.2408
SMILES:
[#8]-c1cc(F)ccc1-c1ccc(\[#6]=[#6]-2/[#6](=O)-[#7]-[#6](=O)-[#7]-[#6]-2=O)o1
: