Target
Rho-associated protein kinase 2
Ligand
BDBM128294
Substrate
Meas. Tech.
Inhibition Assay
pH
7.5±n/a
Temperature
298.15±n/a K
IC50
<30±n/a nM
Comments
extracted
Citation
 Davies, TGGarrett, MDBoyle, RGCollins, I Purine and deazapurine derivatives as pharmaceutical compounds US Patent  US8796293 Publication Date 8/5/2014 
Target
Name:
Rho-associated protein kinase 2
Synonyms:
KIAA0619 ROCK2 Rho kinase 2 (ROCKII) Rho-associated protein kinase 2 (ROCK2) Rho-associated protein kinase 2/Transforming protein RhoA Rho-associated, coiled-coil-containing protein kinase II p164 ROCK-2
Type:
Protein
Mol. Mass.:
160885.43
Organism:
Homo sapiens (Human)
Description:
O75116
Residue:
1388
  
Inhibitor
Name:
BDBM128294
Synonyms:
US8796293, 30
Type:
Small organic molecule
Emp. Form.:
C19H20F3N5O
Mol. Mass.:
391.3902
SMILES:
NCC1(CCN(CC1)c1ncnc2[nH]ccc12)c1ccc(OC(F)(F)F)cc1
: