Target
Fatty acid synthase
Ligand
BDBM128358
Substrate
Meas. Tech.
Biological Assay
pH
7±n/a
IC50
20±n/a nM
Comments
extracted
Citation
 Adams, NDAquino, CJChaudhari, AMGhergurovich, JMKiesow, TJParrish, CAReif, AJWiggall, K Triazolones as fatty acid synthase inhibitors US Patent  US8802864 Publication Date 8/12/2014 
Target
Name:
Fatty acid synthase
Synonyms:
FAS FAS_HUMAN HU FASN
Type:
Enzyme
Mol. Mass.:
273419.37
Organism:
Homo sapiens (Human)
Description:
P49327
Residue:
2511
  
Inhibitor
Name:
BDBM128358
Synonyms:
US8802864, 7
Type:
Small organic molecule
Emp. Form.:
C26H26N4O3
Mol. Mass.:
442.5096
SMILES:
Cn1nc(C[C@@H]2CCN(C2)C(=O)C2CC2)n(-c2ccc(cc2)-c2ccc3occc3c2)c1=O
: