Target
Fatty acid synthase
Ligand
BDBM128360
Substrate
Meas. Tech.
Biological Assay
pH
7±n/a
IC50
13±n/a nM
Comments
extracted
Citation
 Adams, NDAquino, CJChaudhari, AMGhergurovich, JMKiesow, TJParrish, CAReif, AJWiggall, K Triazolones as fatty acid synthase inhibitors US Patent  US8802864 Publication Date 8/12/2014 
Target
Name:
Fatty acid synthase
Synonyms:
FAS FAS_HUMAN HU FASN
Type:
Enzyme
Mol. Mass.:
273419.37
Organism:
Homo sapiens (Human)
Description:
P49327
Residue:
2511
  
Inhibitor
Name:
BDBM128360
Synonyms:
US8802864, 23
Type:
Small organic molecule
Emp. Form.:
C25H26N6O2
Mol. Mass.:
442.5129
SMILES:
Cn1cnc2cc(ccc12)-c1ccc(cc1)-n1c(C[C@@H]2CCN(C2)C(=O)C2CC2)n[nH]c1=O
: