Target
Trace amine-associated receptor 1
Ligand
BDBM129367
Substrate
Meas. Tech.
Radioligand Binding
pH
7.4±n/a
Temperature
310.15±n/a K
Ki
18.1±n/a nM
Comments
extracted
Citation
 Galley, GNorcross, RDPflieger, P Heterocyclic amine derivatives US Patent  US8802673 Publication Date 8/12/2014 
Target
Name:
Trace amine-associated receptor 1
Synonyms:
TAAR1_MOUSE Taar1 Trace amine receptor 1 (TARR1) Trace amine-associated receptor1 | Trar1
Type:
Protein
Mol. Mass.:
37635.41
Organism:
Mus musculus (Mouse)
Description:
Q923Y8
Residue:
332
  
Inhibitor
Name:
BDBM129367
Synonyms:
US8802673, 9
Type:
Small organic molecule
Emp. Form.:
C17H19ClN2O
Mol. Mass.:
302.799
SMILES:
Clc1ccc(CNc2ccc(cc2)C2CNCCO2)cc1
: