Target
Trace amine-associated receptor 7b
Ligand
BDBM129457
Substrate
Meas. Tech.
Radioligand Binding
pH
7.4±n/a
Temperature
310.15±n/a K
Ki
18.5±n/a nM
Comments
extracted
Citation
 Galley, GNorcross, RDPflieger, P Heterocyclic amine derivatives US Patent  US8802673 Publication Date 8/12/2014 
Target
Name:
Trace amine-associated receptor 7b
Synonyms:
TAA7B_RAT Taar7b Trace amine-associated receptor 1 (TAAR1) | Trar12
Type:
Enzyme
Mol. Mass.:
40296.65
Organism:
Rattus norvegicus (Rat)
Description:
Q923X8
Residue:
358
  
Inhibitor
Name:
BDBM129457
Synonyms:
US8802673, 99
Type:
Small organic molecule
Emp. Form.:
C15H15ClFN3O
Mol. Mass.:
307.751
SMILES:
Fc1cc(ccc1Nc1ccc(Cl)cn1)C1CNCCO1
: