Target
Muscarinic acetylcholine receptor M3
Ligand
BDBM6449
Substrate
Meas. Tech.
Radioligand Binding Assay
Ki
0.1±n/a nM
Citation
 Hughes, ADChen, YJacobsen, JRStangeland, ELYen, R Diamide compounds having muscarinic receptor antagonist and β2 adrenergic receptor agonist activity US Patent  US8816088 Publication Date 8/26/2014 
Target
Name:
Muscarinic acetylcholine receptor M3
Synonyms:
ACM3_HUMAN Cholinergic, muscarinic M3 Muscarinic receptor M3 | RecName: Full=Muscarinic acetylcholine receptor M3
Type:
Enzyme
Mol. Mass.:
66151.03
Organism:
Homo sapiens (Human)
Description:
P20309
Residue:
590
  
Inhibitor
Name:
BDBM6449
Synonyms:
US8551978, I-87 US9394275, I-7 | US9682957, I-87
Type:
Emp. Form.:
C52H58N6O7
Mol. Mass.:
879.0529
SMILES:
C[C@H](Cc1cccc(CCNC(=O)Cc2ccc(cc2)N(C)C(=O)CCN2CCC(CC2)OC(=O)Nc2ccccc2-c2ccccc2)c1)NC[C@H](O)c1ccc(O)c2[nH]c(=O)ccc12
: