Target
Protein UL24 homolog
Ligand
BDBM36460
Substrate
Meas. Tech.
Nuclear Magnetic Resonance (NMR) Assay
pH
8±n/a
IC50
1.5e+3± 3e+2 nM
Comments
extracted
Citation
 Gable, JELee, GMJaishankar, PHearn, BRWaddling, CARenslo, ARCraik, CS Broad-spectrum allosteric inhibition of herpesvirus proteases. Biochemistry 53:4648-60 (2014)  
Target
Name:
Protein UL24 homolog
Synonyms:
Kaposi's sarcoma-associated herpesvirus protease (KSHV Pr) UL24_HHV8P
Type:
Protein
Mol. Mass.:
28447.41
Organism:
Human herpesvirus 8
Description:
Q2HRB2
Residue:
257
  
Inhibitor
Name:
BDBM36460
Synonyms:
3-Benzyl-4-(6-(cyclohexylmethyl)picolinamido)benzoic acid, 2 DD2
Type:
Small organic moelcule
Emp. Form.:
C27H28N2O3
Mol. Mass.:
428.5228
SMILES:
OC(=O)c1ccc(NC(=O)c2cccc(CC3CCCCC3)n2)c(Cc2ccccc2)c1
: