Target
Epstein-Barr nuclear antigen 1
Ligand
BDBM130377
Substrate
Meas. Tech.
Nuclear Magnetic Resonance (NMR) Assay
pH
8±n/a
IC50
1.9e+4± 1e+3 nM
Comments
extracted
Citation
 Gable, JELee, GMJaishankar, PHearn, BRWaddling, CARenslo, ARCraik, CS Broad-spectrum allosteric inhibition of herpesvirus proteases. Biochemistry 53:4648-60 (2014)  
Target
Name:
Epstein-Barr nuclear antigen 1
Synonyms:
EBNA-1 protein EBNA1_EBVB9 | Epstein-Barr virus protease (EBV Pr)
Type:
Enzyme Catalytic Domain
Mol. Mass.:
56444.81
Organism:
Human herpesvirus 4
Description:
gi_23893623
Residue:
641
  
Inhibitor
Name:
BDBM130377
Synonyms:
N-[2-Benzyl-4-(methylsulfonylcarbamoyl)phenyl]-6-(cyclohexylmethyl)pyridine-2- carboxamide (3)
Type:
Small organic molecule
Emp. Form.:
C28H31N3O4S
Mol. Mass.:
505.628
SMILES:
CS(=O)(=O)NC(=O)c1ccc(NC(=O)c2cccc(CC3CCCCC3)n2)c(Cc2ccccc2)c1
: