Target
Ketohexokinase
Ligand
BDBM50349724
Substrate
Meas. Tech.
Enzyme Assay
Temperature
298.15±n/a K
IC50
560±n/a nM
Comments
extracted
Citation
 Zhang, XAbad, MCGibbs, ACKuo, GKuo, LCSong, FSui, Z Indazole compounds useful as ketohexokinase inhibitors US Patent  US8822447 Publication Date 9/2/2014 
Target
Name:
Ketohexokinase
Synonyms:
Hepatic fructokinase KHK_HUMAN Ketohexokinase (KHK) | Ketohexokinase (KHK) Isoform C
Type:
Enzyme Catalytic Domain
Mol. Mass.:
32521.64
Organism:
Homo sapiens (Human)
Description:
Residue:
298
  
Inhibitor
Name:
BDBM50349724
Synonyms:
CHEMBL1809151 US9771375, Example 1
Type:
Small organic molecule
Emp. Form.:
C18H20N4S
Mol. Mass.:
324.443
SMILES:
CSc1nn(-c2ccccc2)c2cc(ccc12)N1CCNCC1
: